Target
Aurora kinase C
Ligand
BDBM50394779
Substrate
Meas. Tech.
ChEMBL_859557 (CHEMBL2168186)
Kd
<10±n/a nM
Citation
 Liu, GAbraham, STran, LVickers, TDXu, SHadd, MJQuiambao, SHolladay, MWHua, HFord Pulido, JMGunawardane, RNDavis, MIEichelberger, SRApuy, JLGitnick, DGardner, MFJames, JBreider, MABelli, BArmstrong, RCTreiber, DK Discovery of highly potent and selective pan-Aurora kinase inhibitors with enhanced in vivo antitumor therapeutic index. J Med Chem 55:3250-60 (2012)  
Target
Name:
Aurora kinase C
Synonyms:
AIE2 AIRK3 AURKC Aurora Kinase C (Aurora-C) Aurora kinase C (AURKC) Aurora-C/INCENP Aurora/Ipl1/Eg2 protein 2 Serine/threonine-protein kinase 13 | Serine/threonine-protein kinase Aurora-C
Type:
Enzyme
Mol. Mass.:
35602.43
Organism:
Homo sapiens (Human)
Description:
Amino acid residues 1-309 were expressed as His-tagged fusion protein using baculovirus expression system.
Residue:
309
  
Inhibitor
Name:
BDBM50394779
Synonyms:
CHEMBL2163394
Type:
Small organic molecule
Emp. Form.:
C28H33N9O2S
Mol. Mass.:
559.686
SMILES:
Cc1cc(Nc2nc(Sc3ccc(NC(=O)CN4CC[C@H](C4)C(=O)NC4CCCC4)cc3)nn3cccc23)n[nH]1
: