Target
Lysosomal acid glucosylceramidase
Ligand
BDBM50394823
Substrate
Meas. Tech.
ChEMBL_860087 (CHEMBL2168213)
pH
5.2±n/a
IC50
670±n/a nM
Comments
extracted
Citation
 Trapero, AGonzález-Bulnes, PButters, TDLlebaria, A Potent aminocyclitol glucocerebrosidase inhibitors are subnanomolar pharmacological chaperones for treating gaucher disease. J Med Chem 55:4479-88 (2012)  
Target
Name:
Lysosomal acid glucosylceramidase
Synonyms:
Acid beta-glucosidase Beta-glucocerebrosidase D-glucosyl-N-acylsphingosine glucohydrolase GBA1 GC GLUC Glucosylceramidase (GBA) Glucosylceramidase precursor (Beta-glucocerebrosidase) (Acid beta-glucosidase) (D-glucosyl-N-acylsphingosine glucohydrolase) (Alglucerase) (Imiglucerase) beta-glucocerebrosidase (GCase)
Type:
Enzyme
Mol. Mass.:
59724.64
Organism:
Homo sapiens (Human)
Description:
The beta-Glu activity was measured with commercially available beta-glucocerebrosidase (Ceredase) as the enzyme source.
Residue:
536
  
Inhibitor
Name:
BDBM50394823
Synonyms:
CHEMBL2164229
Type:
Small organic molecule
Emp. Form.:
C24H49NO5
Mol. Mass.:
431.6496
SMILES:
CCCCCCCCCN[C@H]1[C@H](O)[C@@H](O)[C@H](O)[C@@H](O)[C@@H]1OCCCCCCCCC
: