Target
Platelet glycoprotein 4
Ligand
BDBM50394981
Substrate
Meas. Tech.
ChEMBL_858884 (CHEMBL2167930)
IC50
>10000±n/a nM
Citation
 Proulx, CPicard, ÉBoeglin, DPohankova, PChemtob, SOng, HLubell, WD Azapeptide analogues of the growth hormone releasing peptide 6 as cluster of differentiation 36 receptor ligands with reduced affinity for the growth hormone secretagogue receptor 1a. J Med Chem 55:6502-11 (2012)  
Target
Name:
Platelet glycoprotein 4
Synonyms:
Adipocyte membrane protein CD_antigen=CD36 Fat Fatty acid transport protein GPIV PAS IV Platelet glycoprotein IV
Type:
PROTEIN
Mol. Mass.:
52740.95
Organism:
Rattus norvegicus
Description:
ChEMBL_858884
Residue:
472
  
Inhibitor
Name:
BDBM50394981
Synonyms:
CHEMBL2163468
Type:
Small organic molecule
Emp. Form.:
C33H40N10O4
Mol. Mass.:
640.7353
SMILES:
CC(C)CN(NC(=O)[C@@H](Cc1c[nH]c2ccccc12)NC(=O)[C@@H](N)Cc1cnc[nH]1)C(=O)N[C@@H](Cc1c[nH]c2ccccc12)C(N)=O
: