Target
Free fatty acid receptor 1
Ligand
BDBM50386790
Substrate
Meas. Tech.
ChEMBL_859283 (CHEMBL2166571)
EC50
26±n/a nM
Citation
 Christiansen, EDue-Hansen, MEUrban, CGrundmann, MSchröder, RHudson, BDMilligan, GCawthorne, MAKostenis, EKassack, MUUlven, T Free fatty acid receptor 1 (FFA1/GPR40) agonists: mesylpropoxy appendage lowers lipophilicity and improves ADME properties. J Med Chem 55:6624-8 (2012)  
Target
Name:
Free fatty acid receptor 1
Synonyms:
FFAR1 G-protein Coupled Receptor 40 | GPR40
Type:
G Protein-Coupled Receptor (GPCR)
Mol. Mass.:
31473.32
Organism:
Homo sapiens (Human)
Description:
O14842
Residue:
300
  
Inhibitor
Name:
BDBM50386790
Synonyms:
CHEMBL1829174 TAK-875 | US11905230, Example TAK-875
Type:
Small organic molecule
Emp. Form.:
C29H32O7S
Mol. Mass.:
524.625
SMILES:
Cc1cc(OCCCS(C)(=O)=O)cc(C)c1-c1cccc(COc2ccc3[C@H](CC(O)=O)COc3c2)c1
: