Target
Gamma-aminobutyric acid receptor subunit alpha-1
Ligand
BDBM50395121
Substrate
Meas. Tech.
ChEMBL_859592 (CHEMBL2168415)
IC50
3800±n/a nM
Citation
 Savechenkov, PYZhang, XChiara, DCStewart, DSGe, RZhou, XRaines, DECohen, JBForman, SAMiller, KWBruzik, KS Allyl m-trifluoromethyldiazirine mephobarbital: an unusually potent enantioselective and photoreactive barbiturate general anesthetic. J Med Chem 55:6554-65 (2012)  
Target
Name:
Gamma-aminobutyric acid receptor subunit alpha-1
Synonyms:
Benzodiazepine central GABA A Benzodiazepine liver GABA(A) receptor subunit alpha-1 GABA-A receptor GBRA1_HUMAN TBPS | agonist GABA site
Type:
Protein
Mol. Mass.:
51817.35
Organism:
Homo sapiens (Human)
Description:
P14867
Residue:
456
  
Inhibitor
Name:
BDBM50395121
Synonyms:
CHEMBL2163548
Type:
Small organic molecule
Emp. Form.:
C16H13F3N4O3
Mol. Mass.:
366.2946
SMILES:
CN1C(=O)NC(=O)[C@](CC=C)(C1=O)c1cccc(c1)C1(N=N1)C(F)(F)F
: