Target
Gamma-aminobutyric acid receptor subunit alpha-1
Ligand
BDBM50055935
Substrate
Meas. Tech.
ChEMBL_859592 (CHEMBL2168415)
IC50
1000000±n/a nM
Citation
 Savechenkov, PYZhang, XChiara, DCStewart, DSGe, RZhou, XRaines, DECohen, JBForman, SAMiller, KWBruzik, KS Allyl m-trifluoromethyldiazirine mephobarbital: an unusually potent enantioselective and photoreactive barbiturate general anesthetic. J Med Chem 55:6554-65 (2012)  
Target
Name:
Gamma-aminobutyric acid receptor subunit alpha-1
Synonyms:
Benzodiazepine central GABA A Benzodiazepine liver GABA(A) receptor subunit alpha-1 GABA-A receptor GBRA1_HUMAN TBPS | agonist GABA site
Type:
Protein
Mol. Mass.:
51817.35
Organism:
Homo sapiens (Human)
Description:
P14867
Residue:
456
  
Inhibitor
Name:
BDBM50055935
Synonyms:
5-Ethyl-5-(1-methylbutyl)-2,4,6(1H,3H,5H)-pyrimidinetrione 5-ethyl-5-(pentan-2-yl)pyrimidine-2,4,6(1H,3H,5H)-trione CHEMBL448 PENTOBARBITAL | Pentobarbitone
Type:
Small organic molecule
Emp. Form.:
C11H18N2O3
Mol. Mass.:
226.2722
SMILES:
CCCC(C)C1(CC)C(=O)NC(=O)NC1=O
: