Target
Gamma-aminobutyric acid receptor subunit beta-3
Ligand
BDBM50055935
Substrate
Meas. Tech.
ChEMBL_859593 (CHEMBL2168416)
IC50
88000±n/a nM
Citation
 Savechenkov, PYZhang, XChiara, DCStewart, DSGe, RZhou, XRaines, DECohen, JBForman, SAMiller, KWBruzik, KS Allyl m-trifluoromethyldiazirine mephobarbital: an unusually potent enantioselective and photoreactive barbiturate general anesthetic. J Med Chem 55:6554-65 (2012)  
Target
Name:
Gamma-aminobutyric acid receptor subunit beta-3
Synonyms:
GABA A receptor alpha-4/beta-3/gamma-2 GABA-A receptor GBRB3_HUMAN | agonist GABA site
Type:
PROTEIN
Mol. Mass.:
54130.51
Organism:
Homo sapiens (Human)
Description:
ChEMBL_448071
Residue:
473
  
Inhibitor
Name:
BDBM50055935
Synonyms:
5-Ethyl-5-(1-methylbutyl)-2,4,6(1H,3H,5H)-pyrimidinetrione 5-ethyl-5-(pentan-2-yl)pyrimidine-2,4,6(1H,3H,5H)-trione CHEMBL448 PENTOBARBITAL | Pentobarbitone
Type:
Small organic molecule
Emp. Form.:
C11H18N2O3
Mol. Mass.:
226.2722
SMILES:
CCCC(C)C1(CC)C(=O)NC(=O)NC1=O
: