Target
Adenosine receptor A1
Ligand
BDBM11940
Substrate
Meas. Tech.
ChEMBL_859788 (CHEMBL2169616)
EC50
490±n/a nM
Citation
 Korboukh, IHull-Ryde, EARittiner, JERandhawa, ASColeman, JFitzpatrick, BJSetola, VJanzen, WPFrye, SVZylka, MJJin, J Orally active adenosine A(1) receptor agonists with antinociceptive effects in mice. J Med Chem 55:6467-77 (2012)  
Target
Name:
Adenosine receptor A1
Synonyms:
A1 adenosine receptor (hA1) AA1R_HUMAN ADORA1 Adenosine A1-receptor Adenosine receptor A1 (hA1) | Adenosine transporter (AdT)
Type:
G Protein-Coupled Receptor (GPCR)
Mol. Mass.:
36520.92
Organism:
Homo sapiens (Human)
Description:
P30542
Residue:
326
  
Inhibitor
Name:
BDBM11940
Synonyms:
2-AMP Adenosine 2-monophosphate | {[(2R,3R,4R,5R)-2-(6-amino-9H-purin-9-yl)-4-hydroxy-5-(hydroxymethyl)oxolan-3-yl]oxy}phosphonic acid
Type:
Nucleoside or nucleotide
Emp. Form.:
C10H14N5O7P
Mol. Mass.:
347.2212
SMILES:
Nc1ncnc2n(cnc12)[C@@H]1O[C@H](CO)[C@@H](O)[C@H]1OP(O)(O)=O
: