Target
Carbonic anhydrase 2
Ligand
BDBM50395390
Substrate
Meas. Tech.
ChEMBL_857983 (CHEMBL2166491)
Ki
12.9±n/a nM
Citation
 D'Ambrosio, KSmaine, FZCarta, FDe Simone, GWinum, JYSupuran, CT Development of potent carbonic anhydrase inhibitors incorporating both sulfonamide and sulfamide groups. J Med Chem 55:6776-83 (2012)  
Target
Name:
Carbonic anhydrase 2
Synonyms:
CA-II CAC Carbonate dehydratase II Carbonic anhydrase 2 (CA-II) Carbonic anhydrase C Carbonic anhydrase II (CA-II) Carbonic anhydrase II (hCA II) | Carbonic anhydrase isoenzyme II (hCA II)
Type:
Enzyme
Mol. Mass.:
29250.71
Organism:
Homo sapiens (Human)
Description:
P00918
Residue:
260
  
Inhibitor
Name:
BDBM50395390
Synonyms:
CHEMBL2164738
Type:
Small organic molecule
Emp. Form.:
C23H24N4O6S2
Mol. Mass.:
516.59
SMILES:
CC(=O)Nc1ccc(cc1)S(=O)(=O)Nc1ccc(cc1)C(=O)NCCc1ccc(cc1)S(N)(=O)=O
: