Target
Fatty-acid amide hydrolase 1
Ligand
BDBM50395420
Substrate
Meas. Tech.
ChEMBL_858269 (CHEMBL2168075)
IC50
1.9±n/a nM
Citation
 Butini, SBrindisi, MGemma, SMinetti, PCabri, WGallo, GVincenti, STalamonti, EBorsini, FCaprioli, AStasi, MADi Serio, SRos, SBorrelli, GMaramai, SFezza, FCampiani, GMaccarrone, M Discovery of potent inhibitors of human and mouse fatty acid amide hydrolases. J Med Chem 55:6898-915 (2012)  
Target
Name:
Fatty-acid amide hydrolase 1
Synonyms:
Anandamide amidohydrolase FAAH1_MOUSE Faah1 Fatty-acid amide hydrolase (FAAH) Oleamide hydrolase 1
Type:
Hydrolase; single-pass membrane protein; homodimer
Mol. Mass.:
63227.28
Organism:
Mus musculus (mouse)
Description:
Mouse brain membranes were used in the assay.
Residue:
579
  
Inhibitor
Name:
BDBM50395420
Synonyms:
CHEMBL2165070
Type:
Small organic molecule
Emp. Form.:
C25H28N2O3S
Mol. Mass.:
436.566
SMILES:
Cc1cc(C(N)=O)c(s1)-c1cccc(OC(=O)NCCCCCCc2ccccc2)c1
: