Target
Potassium voltage-gated channel subfamily KQT member 4
Ligand
BDBM50395464
Substrate
Meas. Tech.
ChEMBL_858522 (CHEMBL2169526)
IC50
200±n/a nM
Citation
 Cheung, YYYu, HXu, KZou, BWu, MMcManus, OBLi, MLindsley, CWHopkins, CR Discovery of a series of 2-phenyl-N-(2-(pyrrolidin-1-yl)phenyl)acetamides as novel molecular switches that modulate modes of K(v)7.2 (KCNQ2) channel pharmacology: identification of (S)-2-phenyl-N-(2-(pyrrolidin-1-yl)phenyl)butanamide (ML252) as a potent, brain penetrant K(v)7.2 channel inhibitor. J Med Chem 55:6975-9 (2012)  
Target
Name:
Potassium voltage-gated channel subfamily KQT member 4
Synonyms:
KCNQ (Kv7) potassium channel KCNQ4_HUMAN Potassium channel subunit alpha KvLQT4 Voltage-gated potassium channel subunit Kv7.4
Type:
PROTEIN
Mol. Mass.:
77131.10
Organism:
Homo sapiens (Human)
Description:
ChEMBL_1520985
Residue:
695
  
Inhibitor
Name:
BDBM50395464
Synonyms:
CHEMBL2164048
Type:
Small organic molecule
Emp. Form.:
C20H24N2O
Mol. Mass.:
308.4174
SMILES:
CC[C@H](C(=O)Nc1ccccc1N1CCCC1)c1ccccc1
: