Target
Carboxypeptidase B2
Ligand
BDBM50395728
Substrate
Meas. Tech.
ChEMBL_860207 (CHEMBL2168947)
IC50
5.5±n/a nM
Citation
 Yoshimoto, NSasaki, TSugimoto, KIshii, HYamamoto, K Design and characterization of a selenium-containing inhibitor of activated thrombin-activatable fibrinolysis inhibitor (TAFIa), a zinc-containing metalloprotease. J Med Chem 55:7696-705 (2012)  
Target
Name:
Carboxypeptidase B2
Synonyms:
CBPB2_HUMAN CPU Carboxypeptidase B2 isoform A Plasma carboxypeptidase B Thrombin-activable fibrinolysis inhibitor | pCPB
Type:
Enzyme
Mol. Mass.:
48432.74
Organism:
Homo sapiens (Human)
Description:
Q96IY4
Residue:
423
  
Inhibitor
Name:
BDBM50395728
Synonyms:
CHEMBL2164463
Type:
Small organic molecule
Emp. Form.:
C21H35N2O5P
Mol. Mass.:
426.4868
SMILES:
CC(C)[C@H](NC(=O)CCc1ccccc1)P(O)(=O)C[C@@H](CCCCCN)C(O)=O
: