Target
Carboxypeptidase B
Ligand
BDBM50395741
Substrate
Meas. Tech.
ChEMBL_860206 (CHEMBL2168946)
IC50
36.0±n/a nM
Citation
 Yoshimoto, NSasaki, TSugimoto, KIshii, HYamamoto, K Design and characterization of a selenium-containing inhibitor of activated thrombin-activatable fibrinolysis inhibitor (TAFIa), a zinc-containing metalloprotease. J Med Chem 55:7696-705 (2012)  
Target
Name:
Carboxypeptidase B
Synonyms:
CBPB1_PIG CPB1
Type:
PROTEIN
Mol. Mass.:
47371.10
Organism:
Sus scrofa
Description:
ChEMBL_453905
Residue:
416
  
Inhibitor
Name:
BDBM50395741
Synonyms:
CHEMBL2164453
Type:
Small organic molecule
Emp. Form.:
C8H17NO2S
Mol. Mass.:
191.291
SMILES:
NCCCCCC(CS)C(O)=O
: