Target
5-hydroxytryptamine receptor 6
Ligand
BDBM50395839
Substrate
Meas. Tech.
ChEMBL_861074 (CHEMBL2166665)
Ki
2.68±n/a nM
Citation
 Nirogi, RVKonda, JBKambhampati, RShinde, ABandyala, TRGudla, PKandukuri, KKJayarajan, PKandikere, VDubey, PK N,N-Dimethyl-[9-(arylsulfonyl)-2,3,4,9-tetrahydro-1H-carbazol-3-yl]amines as novel, potent and selective 5-HT6 receptor antagonists. Bioorg Med Chem Lett 22:6980-5 (2012)  
Target
Name:
5-hydroxytryptamine receptor 6
Synonyms:
5-HT-6 5-hydroxytryptamine receptor 6 (5-HT-6) 5-hydroxytryptamine receptor 6 (5HT6) HTR6 Serotonin 6 (5-HT6) receptor | Serotonin Receptor 6
Type:
G Protein-Coupled Receptor (GPCR)
Mol. Mass.:
46968.43
Organism:
Homo sapiens (Human)
Description:
P50406
Residue:
440
  
Inhibitor
Name:
BDBM50395839
Synonyms:
CHEMBL2165540
Type:
Small organic molecule
Emp. Form.:
C21H23ClN2O2S2
Mol. Mass.:
435.003
SMILES:
CSc1ccc2n(c3CCC(Cc3c2c1)N(C)C)S(=O)(=O)c1cccc(Cl)c1
: