Target
UDP-3-O-acyl-N-acetylglucosamine deacetylase
Ligand
BDBM50395910
Substrate
Meas. Tech.
ChEMBL_858075 (CHEMBL2166987)
IC50
0.912±n/a nM
Citation
 McAllister, LAMontgomery, JIAbramite, JAReilly, UBrown, MFChen, JMBarham, RAChe, YChung, SWMenard, CAMitton-Fry, MMullins, LMNoe, MCO'Donnell, JPOliver, RMPenzien, JBPlummer, MPrice, LMShanmugasundaram, VTomaras, APUccello, DP Heterocyclic methylsulfone hydroxamic acid LpxC inhibitors as Gram-negative antibacterial agents. Bioorg Med Chem Lett 22:6832-8 (2012)  
Target
Name:
UDP-3-O-acyl-N-acetylglucosamine deacetylase
Synonyms:
lpxC
Type:
PROTEIN
Mol. Mass.:
21890.40
Organism:
Pseudomonas aeruginosa
Description:
ChEMBL_858075
Residue:
197
  
Inhibitor
Name:
BDBM50395910
Synonyms:
CHEMBL2164522
Type:
Small organic molecule
Emp. Form.:
C14H16ClFN4O4S
Mol. Mass.:
390.818
SMILES:
C[C@@](CCn1cc(nn1)-c1ccc(Cl)c(F)c1)(C(=O)NO)S(C)(=O)=O
: