Target
UDP-3-O-acyl-N-acetylglucosamine deacetylase
Ligand
BDBM50395915
Substrate
Meas. Tech.
ChEMBL_858075 (CHEMBL2166987)
IC50
>100±n/a nM
Citation
 McAllister, LAMontgomery, JIAbramite, JAReilly, UBrown, MFChen, JMBarham, RAChe, YChung, SWMenard, CAMitton-Fry, MMullins, LMNoe, MCO'Donnell, JPOliver, RMPenzien, JBPlummer, MPrice, LMShanmugasundaram, VTomaras, APUccello, DP Heterocyclic methylsulfone hydroxamic acid LpxC inhibitors as Gram-negative antibacterial agents. Bioorg Med Chem Lett 22:6832-8 (2012)  
Target
Name:
UDP-3-O-acyl-N-acetylglucosamine deacetylase
Synonyms:
lpxC
Type:
PROTEIN
Mol. Mass.:
21890.40
Organism:
Pseudomonas aeruginosa
Description:
ChEMBL_858075
Residue:
197
  
Inhibitor
Name:
BDBM50395915
Synonyms:
CHEMBL2164517
Type:
Small organic molecule
Emp. Form.:
C14H18N4O4S
Mol. Mass.:
338.382
SMILES:
CC(CCc1nnc([nH]1)-c1ccccc1)(C(=O)NO)S(C)(=O)=O
: