Target
Metabotropic glutamate receptor 5
Ligand
BDBM50395925
Substrate
Meas. Tech.
ChEMBL_858087 (CHEMBL2166999)
IC50
>10000±n/a nM
Citation
 Raboisson, PBreitholtz-Emanuelsson, ADahllöf, HEdwards, LHeaton, WLIsaac, MJarvie, KKers, AMinidis, ABNordmark, ASheehan, SMSlassi, AStröm, PTerelius, YWensbo, DWilson, JMXin, TMcLeod, DA Discovery and characterization of AZD9272 and AZD6538-Two novel mGluR5 negative allosteric modulators selected for clinical development. Bioorg Med Chem Lett 22:6974-9 (2012)  
Target
Name:
Metabotropic glutamate receptor 5
Synonyms:
GPRC1E GRM5_HUMAN metabotropic glutamate 5 | metabotropic glutamate 5a
Type:
Enzyme
Mol. Mass.:
132484.72
Organism:
Homo sapiens (Human)
Description:
Residue:
1212
  
Inhibitor
Name:
BDBM50395925
Synonyms:
CHEMBL2164542
Type:
Small organic molecule
Emp. Form.:
C15H7F6N3O
Mol. Mass.:
359.226
SMILES:
FC(F)(F)c1cc(cc(c1)C(F)(F)F)-c1nc(no1)-c1ccccn1
: