Target
Muscarinic acetylcholine receptor M1
Ligand
BDBM50395973
Substrate
Meas. Tech.
ChEMBL_858567 (CHEMBL2166012)
IC50
38±n/a nM
Citation
 Poslusney, MSSevel, CUtley, TJBridges, TMMorrison, RDKett, NRSheffler, DJNiswender, CMDaniels, JSConn, PJLindsley, CWWood, MR Synthesis and biological characterization of a series of novel diaryl amide M1 antagonists. Bioorg Med Chem Lett 22:6923-8 (2012)  
Target
Name:
Muscarinic acetylcholine receptor M1
Synonyms:
ACM1_HUMAN Cholinergic receptor, muscarinic 1 | Cholinergic, muscarinic M1
Type:
Protein
Mol. Mass.:
51442.54
Organism:
Homo sapiens (Human)
Description:
P11229
Residue:
460
  
Inhibitor
Name:
BDBM50395973
Synonyms:
CHEMBL2164895
Type:
Small organic molecule
Emp. Form.:
C22H28N2O
Mol. Mass.:
336.4705
SMILES:
CCN1CCCN(CC1)C(=O)C(Cc1ccccc1)c1ccccc1
: