Target
Estrogen receptor
Ligand
BDBM20625
Substrate
Meas. Tech.
ChEMBL_863171 (CHEMBL2175782)
IC50
770±n/a nM
Citation
 Chen, XYPark, SJBuschmann, HDe Rosa, MBolm, C Syntheses and biological activities of sulfoximine-based acyclic triaryl olefins. Bioorg Med Chem Lett 22:4307-9 (2012)  
Target
Name:
Estrogen receptor
Synonyms:
ER ESR ESR1_HUMAN Estrogen receptor Estrogen receptor (ER-alpha) Estrogen receptor alpha (ER) Nuclear receptor subfamily 3 group A member 1
Type:
Protein
Mol. Mass.:
66230.44
Organism:
Homo sapiens (Human)
Description:
P03372
Residue:
595
  
Inhibitor
Name:
BDBM20625
Synonyms:
4-[(3E)-4-(4-hydroxyphenyl)hex-3-en-3-yl]phenol CHEMBL411 Diethylstilbestrol (1) Stilboestroform
Type:
Small organic molecule
Emp. Form.:
C18H20O2
Mol. Mass.:
268.3502
SMILES:
CC\C(=C(\CC)c1ccc(O)cc1)c1ccc(O)cc1
: