Target
Interleukin-1 receptor-associated kinase 1
Ligand
BDBM50396243
Substrate
Meas. Tech.
ChEMBL_863862 (CHEMBL2176252)
Kd
5.7±n/a nM
Citation
 Lewis, RTBode, CMChoquette, DMPotashman, MRomero, KStellwagen, JCTeffera, YMoore, EWhittington, DAChen, HEpstein, LFEmkey, RAndrews, PSYu, VLSaffran, DCXu, MDrew, AMerkel, PSzilvassy, SBrake, RL The discovery and optimization of a novel class of potent, selective, and orally bioavailable anaplastic lymphoma kinase (ALK) inhibitors with potential utility for the treatment of cancer. J Med Chem 55:6523-40 (2012)  
Target
Name:
Interleukin-1 receptor-associated kinase 1
Synonyms:
IRAK IRAK1 Interleukin-1 receptor-associated kinase 1 (IRAK-1)
Type:
Enzyme
Mol. Mass.:
76536.81
Organism:
Homo sapiens (Human)
Description:
P51617
Residue:
712
  
Inhibitor
Name:
BDBM50396243
Synonyms:
CHEMBL2172308 | US10370379, Compound TSR-011
Type:
Small organic molecule
Emp. Form.:
C33H44FN5O3
Mol. Mass.:
577.7326
SMILES:
CC(C)NC(=O)[C@H]1CC[C@H](CC1)n1c(NC(=O)c2ccc(F)cc2)nc2ccc(CN3CCC(CC3)C(C)(C)O)cc12
: