Target
Serine/threonine-protein kinase mTOR
Ligand
BDBM50396305
Substrate
Meas. Tech.
ChEMBL_864284 (CHEMBL2175555)
IC50
2±n/a nM
Citation
 Peterson, EABoezio, AAAndrews, PSBoezio, CMBush, TLCheng, ACChoquette, DCoats, JRColletti, AECopeland, KWDuPont, MGraceffa, RGrubinska, BKim, JLLewis, RTLiu, JMullady, ELPotashman, MHRomero, KShaffer, PLStanton, MKStellwagen, JCTeffera, YYi, SCai, TLa, DS Discovery and optimization of potent and selective imidazopyridine and imidazopyridazine mTOR inhibitors. Bioorg Med Chem Lett 22:4967-74 (2012)  
Target
Name:
Serine/threonine-protein kinase mTOR
Synonyms:
FK506-binding protein 12-rapamycin complex-associated protein 1 FRAP FRAP1 MTOR Mammalian Target of Rapamycin (mTOR) RAFT1 Rapamycin and FKBP12 target 1 Serine/threonine-protein kinase (mTOR) | mTORC2
Type:
Rapamycin target protein
Mol. Mass.:
288917.12
Organism:
Homo sapiens (Human)
Description:
P42345
Residue:
2549
  
Inhibitor
Name:
BDBM50396305
Synonyms:
CHEMBL2172482
Type:
Small organic molecule
Emp. Form.:
C20H18N10
Mol. Mass.:
398.4239
SMILES:
Cc1nc(N)nc(n1)-c1c(Nc2ccn[nH]2)nc2ccc(cn12)-c1cnccc1C
: