Target
Sigma non-opioid intracellular receptor 1
Ligand
BDBM50396365
Substrate
Meas. Tech.
ChEMBL_861906 (CHEMBL2173634)
Ki
24±n/a nM
Citation
 Díaz, JLCuberes, RBerrocal, JContijoch, MChristmann, UFernández, APort, AHolenz, JBuschmann, HLaggner, CSerafini, MTBurgueño, JZamanillo, DMerlos, MVela, JMAlmansa, C Synthesis and biological evaluation of the 1-arylpyrazole class ofs(1) receptor antagonists: identification of 4-{2-[5-methyl-1-(naphthalen-2-yl)-1H-pyrazol-3-yloxy]ethyl}morpholine (S1RA, E-52862). J Med Chem 55:8211-24 (2012)  
Target
Name:
Sigma non-opioid intracellular receptor 1
Synonyms:
Aging-associated gene 8 protein SGMR1_HUMAN SIGMAR1 SR31747-binding protein Sigma 1-type opioid receptor Sigma1R | hSigmaR1
Type:
Enzyme Catalytic Domain
Mol. Mass.:
25124.85
Organism:
Homo sapiens (Human)
Description:
Q99720
Residue:
223
  
Inhibitor
Name:
BDBM50396365
Synonyms:
CHEMBL2170205
Type:
Small organic molecule
Emp. Form.:
C21H23Cl2N3O
Mol. Mass.:
404.333
SMILES:
CN(CCCCOc1ccn(n1)-c1ccc(Cl)c(Cl)c1)Cc1ccccc1
: