Target
Lysosomal protective protein
Ligand
BDBM50396560
Substrate
Meas. Tech.
ChEMBL_863255 (CHEMBL2176198)
IC50
10±n/a nM
Citation
 Ruf, SBuning, CSchreuder, HHorstick, GLinz, WOlpp, TPernerstorfer, JHiss, KKroll, KKannt, AKohlmann, MLinz, DHübschle, TRütten, HWirth, KSchmidt, TSadowski, T Novelß-amino acid derivatives as inhibitors of cathepsin A. J Med Chem 55:7636-49 (2012)  
Target
Name:
Lysosomal protective protein
Synonyms:
CTSA Cathepsin A (CTSA) PPGB | PPGB_HUMAN
Type:
Protein
Mol. Mass.:
54465.95
Organism:
Homo sapiens (Human)
Description:
P10619
Residue:
480
  
Inhibitor
Name:
BDBM50396560
Synonyms:
CHEMBL2171394
Type:
Small organic molecule
Emp. Form.:
C26H30FN3O5
Mol. Mass.:
483.5319
SMILES:
Cc1ccccc1[C@H](CC(O)=O)NC(=O)c1cc(OC[C@@H](O)C(C)(C)C)n(n1)-c1ccccc1F
: