Target
Lysosomal protective protein
Ligand
BDBM50396586
Substrate
Meas. Tech.
ChEMBL_863255 (CHEMBL2176198)
IC50
110±n/a nM
Citation
 Ruf, SBuning, CSchreuder, HHorstick, GLinz, WOlpp, TPernerstorfer, JHiss, KKroll, KKannt, AKohlmann, MLinz, DHübschle, TRütten, HWirth, KSchmidt, TSadowski, T Novelß-amino acid derivatives as inhibitors of cathepsin A. J Med Chem 55:7636-49 (2012)  
Target
Name:
Lysosomal protective protein
Synonyms:
CTSA Cathepsin A (CTSA) PPGB | PPGB_HUMAN
Type:
Protein
Mol. Mass.:
54465.95
Organism:
Homo sapiens (Human)
Description:
P10619
Residue:
480
  
Inhibitor
Name:
BDBM50396586
Synonyms:
CHEMBL2171400
Type:
Small organic molecule
Emp. Form.:
C21H19ClFN3O4
Mol. Mass.:
431.845
SMILES:
COc1c(Cl)c(nn1-c1ccccc1F)C(=O)N[C@@H](CC(O)=O)c1ccccc1C
: