Target
Lysosomal protective protein
Ligand
BDBM50396556
Substrate
Meas. Tech.
ChEMBL_863255 (CHEMBL2176198)
IC50
15±n/a nM
Citation
 Ruf, SBuning, CSchreuder, HHorstick, GLinz, WOlpp, TPernerstorfer, JHiss, KKroll, KKannt, AKohlmann, MLinz, DHübschle, TRütten, HWirth, KSchmidt, TSadowski, T Novelß-amino acid derivatives as inhibitors of cathepsin A. J Med Chem 55:7636-49 (2012)  
Target
Name:
Lysosomal protective protein
Synonyms:
CTSA Cathepsin A (CTSA) PPGB | PPGB_HUMAN
Type:
Protein
Mol. Mass.:
54465.95
Organism:
Homo sapiens (Human)
Description:
P10619
Residue:
480
  
Inhibitor
Name:
BDBM50396556
Synonyms:
CHEMBL2171398
Type:
Small organic molecule
Emp. Form.:
C24H24FN3O4
Mol. Mass.:
437.4635
SMILES:
Cc1ccccc1[C@H](CC(O)=O)NC(=O)c1cc(OCC2CC2)n(n1)-c1ccccc1F
: