Target
Lysosomal protective protein
Ligand
BDBM50396557
Substrate
Meas. Tech.
ChEMBL_863255 (CHEMBL2176198)
IC50
15±n/a nM
Citation
 Ruf, SBuning, CSchreuder, HHorstick, GLinz, WOlpp, TPernerstorfer, JHiss, KKroll, KKannt, AKohlmann, MLinz, DHübschle, TRütten, HWirth, KSchmidt, TSadowski, T Novelß-amino acid derivatives as inhibitors of cathepsin A. J Med Chem 55:7636-49 (2012)  
Target
Name:
Lysosomal protective protein
Synonyms:
CTSA Cathepsin A (CTSA) PPGB | PPGB_HUMAN
Type:
Protein
Mol. Mass.:
54465.95
Organism:
Homo sapiens (Human)
Description:
P10619
Residue:
480
  
Inhibitor
Name:
BDBM50396557
Synonyms:
CHEMBL2171397
Type:
Small organic molecule
Emp. Form.:
C22H22FN3O4
Mol. Mass.:
411.4262
SMILES:
CCOc1cc(nn1-c1ccccc1F)C(=O)N[C@@H](CC(O)=O)c1ccccc1C
: