Target
Neprilysin
Ligand
BDBM50396555
Substrate
Meas. Tech.
ChEMBL_863254 (CHEMBL2176197)
IC50
1900±n/a nM
Citation
 Ruf, SBuning, CSchreuder, HHorstick, GLinz, WOlpp, TPernerstorfer, JHiss, KKroll, KKannt, AKohlmann, MLinz, DHübschle, TRütten, HWirth, KSchmidt, TSadowski, T Novelß-amino acid derivatives as inhibitors of cathepsin A. J Med Chem 55:7636-49 (2012)  
Target
Name:
Neprilysin
Synonyms:
Atriopeptidase CD_antigen=CD10 EPN MME NEP_HUMAN Neutral endopeptidase | Neutral endopeptidase 24.11
Type:
Enzyme
Mol. Mass.:
85505.38
Organism:
Homo sapiens (Human)
Description:
P08473
Residue:
750
  
Inhibitor
Name:
BDBM50396555
Synonyms:
CHEMBL2171396
Type:
Small organic molecule
Emp. Form.:
C21H20FN3O4
Mol. Mass.:
397.3996
SMILES:
COc1cc(nn1-c1ccccc1F)C(=O)N[C@@H](CC(O)=O)c1ccccc1C
: