Target
Phosphatidylinositol 4,5-bisphosphate 3-kinase catalytic subunit delta isoform
Ligand
BDBM50396639
Substrate
Meas. Tech.
ChEMBL_864133 (CHEMBL2174981)
IC50
4±n/a nM
Citation
 Murray, JMSweeney, ZKChan, BKBalazs, MBradley, ECastanedo, GChabot, CChantry, DFlagella, MGoldstein, DMKondru, RLesnick, JLi, JLucas, MCNonomiya, JPang, JPrice, SSalphati, LSafina, BSavy, PPSeward, EMUltsch, MSutherlin, DP Potent and highly selective benzimidazole inhibitors of PI3-kinase delta. J Med Chem 55:7686-95 (2012)  
Target
Name:
Phosphatidylinositol 4,5-bisphosphate 3-kinase catalytic subunit delta isoform
Synonyms:
PI3-kinase p110 subunit delta PI3-kinase subunit p110-delta PIK3CD Phosphatidylinositol 4,5-biphosphate 3-kinase catalytic subunit delta (PIK3CD) Phosphatidylinositol 4,5-bisphosphate 3-kinase 110 kDa catalytic subunit delta (PI3K delta) Phosphatidylinositol 4,5-bisphosphate 3-kinase catalytic subunit delta (PI3Kdelta) Phosphatidylinositol 4,5-bisphosphate 3-kinase catalytic subunit delta isoform (PI3K delta) Phosphatidylinositol 4,5-bisphosphate 3-kinase catalytic subunit delta isoform (PI3K-delta) Phosphatidylinositol 4,5-bisphosphate 3-kinase catalytic subunit delta isoform (PI3Kdelta)
Type:
Enzyme Subunit
Mol. Mass.:
119489.41
Organism:
Homo sapiens (Human)
Description:
O00329
Residue:
1044
  
Inhibitor
Name:
BDBM50396639
Synonyms:
CHEMBL2171948
Type:
Small organic molecule
Emp. Form.:
C30H40N8O3
Mol. Mass.:
560.6904
SMILES:
Cn1c(CN2CCC(CC2)C(C)(C)O)nc2c(nc(nc12)-n1c(nc2ccccc12)C1CCCO1)N1CCOCC1
: