Target
Aminopeptidase N
Ligand
BDBM50396827
Substrate
Meas. Tech.
ChEMBL_862182 (CHEMBL2174433)
IC50
3700±n/a nM
Citation
 Feng, JJin, KZhu, HZhang, XZhang, LLiu, JXu, W A novel aminopeptidase N inhibitor developed by virtual screening approach. Bioorg Med Chem Lett 22:5863-9 (2012)  
Target
Name:
Aminopeptidase N
Synonyms:
AMPN_PIG AP-M Alanyl aminopeptidase Aminopeptidase N (APN) Microsomal aminopeptidase pAPN
Type:
Protein
Mol. Mass.:
108810.25
Organism:
Sus scrofa (Pig)
Description:
P15145
Residue:
963
  
Inhibitor
Name:
BDBM50396827
Synonyms:
CHEMBL1712297
Type:
Small organic molecule
Emp. Form.:
C12H11BrN2O5
Mol. Mass.:
343.13
SMILES:
ONC(=O)CN1C(=O)C2(OCCO2)c2cc(Br)ccc12
: