Target
Sigma non-opioid intracellular receptor 1
Ligand
BDBM21398
Substrate
Meas. Tech.
ChEMBL_862690 (CHEMBL2174238)
Ki
3.9±n/a nM
Citation
 Meyer, CSchepmann, DYanagisawa, SYamaguchi, JDal Col, VLaurini, EItami, KPricl, SWünsch, B Pd-catalyzed direct C-H bond functionalization of spirocyclics1 ligands: generation of a pharmacophore model and analysis of the reverse binding mode by docking into a 3D homology model of thes1 receptor. J Med Chem 55:8047-65 (2012)  
Target
Name:
Sigma non-opioid intracellular receptor 1
Synonyms:
OPRS1 SIGMAR1 Sigma non-opioid intracellular receptor 1 Sigma1-receptor Sterol isomerase-like protein
Type:
Protein
Mol. Mass.:
25307.17
Organism:
Cavia porcellus (Guinea pig)
Description:
Q60492
Residue:
223
  
Inhibitor
Name:
BDBM21398
Synonyms:
4-[4-(4-Chloro-phenyl)-4-hydroxy-piperidin-1-yl]-1-(4-fluoro-phenyl)-butan-1-one;propionate(HCl) CHEMBL54 Haloperidol | Haloperidol, 1
Type:
Small organic molecule
Emp. Form.:
C21H23ClFNO2
Mol. Mass.:
375.864
SMILES:
OC1(CCN(CCCC(=O)c2ccc(F)cc2)CC1)c1ccc(Cl)cc1
: