Target
Cytochrome P450 2C8
Ligand
BDBM50396934
Substrate
Meas. Tech.
ChEMBL_862960 (CHEMBL2175024)
IC50
>30000±n/a nM
Citation
 Cui, JJMcTigue, MNambu, MTran-Dubé, MPairish, MShen, HJia, LCheng, HHoffman, JLe, PJalaie, MGoetz, GHRyan, KGrodsky, NDeng, YLParker, MTimofeevski, SMurray, BWYamazaki, SAguirre, SLi, QZou, HChristensen, J Discovery of a novel class of exquisitely selective mesenchymal-epithelial transition factor (c-MET) protein kinase inhibitors and identification of the clinical candidate 2-(4-(1-(quinolin-6-ylmethyl)-1H-[1,2,3]triazolo[4,5-b]pyrazin-6-yl)-1H-pyrazol-1-yl)ethanol (PF-04217903) for the treatment of J Med Chem 55:8091-109 (2012)  
Target
Name:
Cytochrome P450 2C8
Synonyms:
CP2C8_HUMAN CYPIIC8 P450 IIC2 P450 form 1 | S-mephenytoin 4-hydroxylase
Type:
Protein
Mol. Mass.:
55839.23
Organism:
Homo sapiens (Human)
Description:
P10632
Residue:
490
  
Inhibitor
Name:
BDBM50396934
Synonyms:
CHEMBL2001019 US9062045, Comparator No. 3 (PF-04217903)
Type:
Small organic molecule
Emp. Form.:
C19H16N8O
Mol. Mass.:
372.3833
SMILES:
OCCn1cc(cn1)-c1cnc2nnn(Cc3ccc4ncccc4c3)c2n1
: