Target
Histone-lysine N-methyltransferase SUV39H1
Ligand
BDBM50396978
Substrate
Meas. Tech.
ChEMBL_863116 (CHEMBL2175614)
Ki
>100000±n/a nM
Citation
 Anglin, JLDeng, LYao, YCai, GLiu, ZJiang, HCheng, GChen, PDong, SSong, Y Synthesis and structure-activity relationship investigation of adenosine-containing inhibitors of histone methyltransferase DOT1L. J Med Chem 55:8066-74 (2012)  
Target
Name:
Histone-lysine N-methyltransferase SUV39H1
Synonyms:
H3-K9-HMTase 1 KMT1A Position-effect variegation 3-9 homolog SUV39H1 Su(var)3-9 homolog 1 | Suppressor of variegation 3-9 homolog 1
Type:
PROTEIN
Mol. Mass.:
47917.07
Organism:
Homo sapiens (Human)
Description:
ChEMBL_1473655
Residue:
412
  
Inhibitor
Name:
BDBM50396978
Synonyms:
CHEMBL2171171
Type:
Small organic molecule
Emp. Form.:
C30H44N8O4
Mol. Mass.:
580.7216
SMILES:
CC(C)N(CCCNC(=O)Nc1ccc(cc1)C(C)(C)C)C[C@H]1O[C@H]([C@H](O)[C@@H]1O)n1cnc2c(NCC=C)ncnc12
: