Target
P2Y purinoceptor 12
Ligand
BDBM50397156
Substrate
Meas. Tech.
ChEMBL_864185 (CHEMBL2175134)
Ki
1.5±n/a nM
Citation
 Zech, GHessler, GEvers, AWeiss, TFlorian, PJust, MCzech, JCzechtizky, WGörlitzer, JRuf, SKohlmann, MNazaré, M Identification of high-affinity P2Y12 antagonists based on a phenylpyrazole glutamic acid piperazine backbone. J Med Chem 55:8615-29 (2012)  
Target
Name:
P2Y purinoceptor 12
Synonyms:
ADP-glucose receptor HORK3 P2T(AC) P2Y(AC) P2Y(cyc) P2Y12 platelet ADP receptor Purinergic receptor P2Y12 | SP1999
Type:
Enzyme
Mol. Mass.:
39458.48
Organism:
Homo sapiens (Human)
Description:
Q9H244
Residue:
342
  
Inhibitor
Name:
BDBM50397156
Synonyms:
CHEMBL2172129
Type:
Small organic molecule
Emp. Form.:
C35H47N11O7
Mol. Mass.:
733.8172
SMILES:
CCCCOC(=O)N1CCN(CC1)C(=O)[C@H](CCc1nnn[nH]1)NC(=O)c1cc(OCC(=O)N2CCC[C@H]2C(=O)NC2CCC2)n(n1)-c1ccccc1
: