Target
Vasopressin V2 receptor
Ligand
BDBM50397206
Substrate
Meas. Tech.
ChEMBL_864210 (CHEMBL2175262)
Ki
5.69±n/a nM
Citation
 Loison, SCottet, MOrcel, HAdihou, HRahmeh, RLamarque, LTrinquet, EKellenberger, EHibert, MDurroux, TMouillac, BBonnet, D Selective fluorescent nonpeptidic antagonists for vasopressin V2 GPCR: application to ligand screening and oligomerization assays. J Med Chem 55:8588-602 (2012)  
Target
Name:
Vasopressin V2 receptor
Synonyms:
ADHR AVPR2 DIR Renal-type arginine vasopressin receptor V2R_HUMAN Vasopressin V2 receptor | Vasopressin receptor
Type:
Receptor
Mol. Mass.:
40295.28
Organism:
Homo sapiens (Human)
Description:
P30518
Residue:
371
  
Inhibitor
Name:
BDBM50397206
Synonyms:
CHEMBL2172289
Type:
Small organic molecule
Emp. Form.:
C71H76N10O11S2
Mol. Mass.:
1309.554
SMILES:
CCN1\C(=C\C=C\C=C\C2=[N+](CC)c3ccc(cc3C2(C)C)S([O-])(=O)=O)C(C)(CCCC(=O)NCCn2cc(CNC(=O)CCC(=O)NC3CCCN(C(=O)c4ccc(NC(=O)c5ccccc5-c5ccccc5)cc4)c4ccccc34)nn2)c2cc(ccc12)S(O)(=O)=O
: