Target
Oxytocin receptor
Ligand
BDBM50307117
Substrate
Meas. Tech.
ChEMBL_864207 (CHEMBL2175259)
Ki
63±n/a nM
Citation
 Loison, SCottet, MOrcel, HAdihou, HRahmeh, RLamarque, LTrinquet, EKellenberger, EHibert, MDurroux, TMouillac, BBonnet, D Selective fluorescent nonpeptidic antagonists for vasopressin V2 GPCR: application to ligand screening and oligomerization assays. J Med Chem 55:8588-602 (2012)  
Target
Name:
Oxytocin receptor
Synonyms:
OT-R OXYR_HUMAN | Oxytocin
Type:
Enzyme Catalytic Domain
Mol. Mass.:
42793.26
Organism:
Homo sapiens (Human)
Description:
Oxytocin OXTR HEK293::B2R9L7
Residue:
389
  
Inhibitor
Name:
BDBM50307117
Synonyms:
CHEMBL603708 | N-(4-(2,3,4,5-tetrahydro-1H-benzo[b]azepine-1-carbonyl)phenyl)biphenyl-2-carboxamide
Type:
Small organic molecule
Emp. Form.:
C30H26N2O2
Mol. Mass.:
446.5396
SMILES:
O=C(Nc1ccc(cc1)C(=O)N1CCCCc2ccccc12)c1ccccc1-c1ccccc1
: