Target
Oxytocin receptor
Ligand
BDBM50052954
Substrate
Meas. Tech.
ChEMBL_864207 (CHEMBL2175259)
Ki
30±n/a nM
Citation
 Loison, SCottet, MOrcel, HAdihou, HRahmeh, RLamarque, LTrinquet, EKellenberger, EHibert, MDurroux, TMouillac, BBonnet, D Selective fluorescent nonpeptidic antagonists for vasopressin V2 GPCR: application to ligand screening and oligomerization assays. J Med Chem 55:8588-602 (2012)  
Target
Name:
Oxytocin receptor
Synonyms:
OT-R OXYR_HUMAN | Oxytocin
Type:
Enzyme Catalytic Domain
Mol. Mass.:
42793.26
Organism:
Homo sapiens (Human)
Description:
Oxytocin OXTR HEK293::B2R9L7
Residue:
389
  
Inhibitor
Name:
BDBM50052954
Synonyms:
2-Methyl-N-[4-(2,3,4,5-tetrahydro-benzo[b]azepine-1-carbonyl)-phenyl]-benzamide | CHEMBL119793
Type:
Small organic molecule
Emp. Form.:
C25H24N2O2
Mol. Mass.:
384.4703
SMILES:
Cc1ccccc1C(=O)Nc1ccc(cc1)C(=O)N1CCCCc2ccccc12
: