Target
Vasopressin V1b receptor
Ligand
BDBM50397216
Substrate
Meas. Tech.
ChEMBL_864198 (CHEMBL2175250)
Ki
>10000±n/a nM
Citation
 Loison, SCottet, MOrcel, HAdihou, HRahmeh, RLamarque, LTrinquet, EKellenberger, EHibert, MDurroux, TMouillac, BBonnet, D Selective fluorescent nonpeptidic antagonists for vasopressin V2 GPCR: application to ligand screening and oligomerization assays. J Med Chem 55:8588-602 (2012)  
Target
Name:
Vasopressin V1b receptor
Synonyms:
AVPR V1b AVPR1B Antidiuretic hormone receptor 1b V1bR VPR3 Vasopressin V1b receptor (V1b) Vasopressin V3 receptor
Type:
Enzyme
Mol. Mass.:
46985.01
Organism:
Homo sapiens (Human)
Description:
P47901
Residue:
424
  
Inhibitor
Name:
BDBM50397216
Synonyms:
CHEMBL2172294
Type:
Small organic molecule
Emp. Form.:
C72H80N10O13S2
Mol. Mass.:
1357.595
SMILES:
CCN(CC)c1ccc2c(-c3ccc(cc3S(=O)(=O)NCCOCCOCCOCCn3cc(CNC(=O)CCC(=O)NC4CCCN(C(=O)c5ccc(NC(=O)c6ccccc6-c6ccccc6)cc5)c5ccccc45)nn3)S([O-])(=O)=O)c3ccc(cc3oc2c1)=[N+](CC)CC
: