Target
Eukaryotic initiation factor 4A-I
Ligand
BDBM50335583
Substrate
Meas. Tech.
ChEMBL_864984 (CHEMBL2176058)
EC50
0.8±n/a nM
Citation
 Liu, TNair, SJLescarbeau, ABelani, JPeluso, SConley, JTillotson, BO'Hearn, PSmith, SSlocum, KWest, KHelble, JDouglas, MBahadoor, AAli, JMcGovern, KFritz, CPalombella, VJWylie, ACastro, ACTremblay, MR Synthetic silvestrol analogues as potent and selective protein synthesis inhibitors. J Med Chem 55:8859-78 (2012)  
Target
Name:
Eukaryotic initiation factor 4A-I
Synonyms:
ATP-dependent RNA helicase eIF4A-1 EIF4A IF4A1_HUMAN eIF4A-I
Type:
PROTEIN
Mol. Mass.:
46146.87
Organism:
Homo sapiens (Human)
Description:
ChEMBL_864983
Residue:
406
  
Inhibitor
Name:
BDBM50335583
Synonyms:
CHEMBL555196 | silvestrol
Type:
Small organic molecule
Emp. Form.:
C34H38O13
Mol. Mass.:
654.6577
SMILES:
CO[C@@H]1OC[C@@H](O[C@H]1Oc1cc2O[C@]3([C@@H]([C@H]([C@@H](O)[C@@]3(O)c2c(OC)c1)C(=O)OC)c1ccccc1)c1ccc(OC)cc1)[C@H](O)CO
: