Target
Eukaryotic initiation factor 4A-I
Ligand
BDBM50397420
Substrate
Meas. Tech.
ChEMBL_864984 (CHEMBL2176058)
EC50
0.6±n/a nM
Citation
 Liu, TNair, SJLescarbeau, ABelani, JPeluso, SConley, JTillotson, BO'Hearn, PSmith, SSlocum, KWest, KHelble, JDouglas, MBahadoor, AAli, JMcGovern, KFritz, CPalombella, VJWylie, ACastro, ACTremblay, MR Synthetic silvestrol analogues as potent and selective protein synthesis inhibitors. J Med Chem 55:8859-78 (2012)  
Target
Name:
Eukaryotic initiation factor 4A-I
Synonyms:
ATP-dependent RNA helicase eIF4A-1 EIF4A IF4A1_HUMAN eIF4A-I
Type:
PROTEIN
Mol. Mass.:
46146.87
Organism:
Homo sapiens (Human)
Description:
ChEMBL_864983
Residue:
406
  
Inhibitor
Name:
BDBM50397420
Synonyms:
CHEMBL2170563
Type:
Small organic molecule
Emp. Form.:
C28H28ClNO6
Mol. Mass.:
509.978
SMILES:
COc1ccc(cc1)[C@@]12Oc3cc(Cl)cc(OC)c3[C@]1(O)[C@H](O)[C@@H]([C@H]2c1ccccc1)C(=O)N(C)C
: