Target
Eukaryotic initiation factor 4A-I
Ligand
BDBM50397431
Substrate
Meas. Tech.
ChEMBL_864983 (CHEMBL2176057)
EC50
23±n/a nM
Citation
 Liu, TNair, SJLescarbeau, ABelani, JPeluso, SConley, JTillotson, BO'Hearn, PSmith, SSlocum, KWest, KHelble, JDouglas, MBahadoor, AAli, JMcGovern, KFritz, CPalombella, VJWylie, ACastro, ACTremblay, MR Synthetic silvestrol analogues as potent and selective protein synthesis inhibitors. J Med Chem 55:8859-78 (2012)  
Target
Name:
Eukaryotic initiation factor 4A-I
Synonyms:
ATP-dependent RNA helicase eIF4A-1 EIF4A IF4A1_HUMAN eIF4A-I
Type:
PROTEIN
Mol. Mass.:
46146.87
Organism:
Homo sapiens (Human)
Description:
ChEMBL_864983
Residue:
406
  
Inhibitor
Name:
BDBM50397431
Synonyms:
CHEMBL2170561
Type:
Small organic molecule
Emp. Form.:
C33H37NO10
Mol. Mass.:
607.6476
SMILES:
COc1ccc(cc1)[C@@]12Oc3cc(O[C@H]4COC[C@H](CO)O4)cc(OC)c3[C@]1(O)[C@H](O)[C@@H]([C@H]2c1ccccc1)C(=O)N(C)C
: