Target
Eukaryotic initiation factor 4A-I
Ligand
BDBM50397413
Substrate
Meas. Tech.
ChEMBL_864983 (CHEMBL2176057)
EC50
14±n/a nM
Citation
 Liu, TNair, SJLescarbeau, ABelani, JPeluso, SConley, JTillotson, BO'Hearn, PSmith, SSlocum, KWest, KHelble, JDouglas, MBahadoor, AAli, JMcGovern, KFritz, CPalombella, VJWylie, ACastro, ACTremblay, MR Synthetic silvestrol analogues as potent and selective protein synthesis inhibitors. J Med Chem 55:8859-78 (2012)  
Target
Name:
Eukaryotic initiation factor 4A-I
Synonyms:
ATP-dependent RNA helicase eIF4A-1 EIF4A IF4A1_HUMAN eIF4A-I
Type:
PROTEIN
Mol. Mass.:
46146.87
Organism:
Homo sapiens (Human)
Description:
ChEMBL_864983
Residue:
406
  
Inhibitor
Name:
BDBM50397413
Synonyms:
CHEMBL2170725
Type:
Small organic molecule
Emp. Form.:
C33H36O12
Mol. Mass.:
624.6317
SMILES:
COC(=O)[C@H]1[C@@H](O)[C@@]2(O)c3c(O[C@]2([C@@H]1c1ccccc1)c1ccc(OC)cc1)cc(O[C@H]1COC[C@@H](O1)[C@H](O)CO)cc3OC
: