Target
Bromodomain-containing protein 4
Ligand
BDBM50397603
Substrate
Meas. Tech.
ChEMBL_873082 (CHEMBL2182558)
IC50
15000±n/a nM
Citation
 Bamborough, PDiallo, HGoodacre, JDGordon, LLewis, ASeal, JTWilson, DMWoodrow, MDChung, CW Fragment-based discovery of bromodomain inhibitors part 2: optimization of phenylisoxazole sulfonamides. J Med Chem 55:587-96 (2012)  
Target
Name:
Bromodomain-containing protein 4
Synonyms:
BRD4 Bromodomain-containing protein 4 (BRD4) Protein HUNK1
Type:
Protein
Mol. Mass.:
152264.84
Organism:
Homo sapiens (Human)
Description:
O60885
Residue:
1362
  
Inhibitor
Name:
BDBM50397603
Synonyms:
CHEMBL2181711
Type:
Small organic molecule
Emp. Form.:
C17H23N3O3S
Mol. Mass.:
349.448
SMILES:
Cc1noc(C)c1-c1ccc(C)c(c1)S(=O)(=O)NC1CCNCC1
: