Target
Metabotropic glutamate receptor 3
Ligand
BDBM50397661
Substrate
Meas. Tech.
ChEMBL_873137 (CHEMBL2182986)
EC50
38±n/a nM
Citation
 Wang, JQZhang, ZKuruppu, DBrownell, AL Radiosynthesis of PET radiotracer as a prodrug for imaging group II metabotropic glutamate receptors in vivo. Bioorg Med Chem Lett 22:1958-62 (2012)  
Target
Name:
Metabotropic glutamate receptor 3
Synonyms:
GRM3_RAT Grm3 glutamate receptor, metabotropic 3 precursor
Type:
Protein
Mol. Mass.:
98971.84
Organism:
Rattus norvegicus (Rat)
Description:
P31422
Residue:
879
  
Inhibitor
Name:
BDBM50397661
Synonyms:
EGLUMEGAD
Type:
Small organic molecule
Emp. Form.:
C8H11NO4
Mol. Mass.:
185.1772
SMILES:
N[C@]1(CC[C@H]2[C@@H]([C@@H]12)C(O)=O)C(O)=O
: