Target
Cytochrome P450 2B6
Ligand
BDBM50397662
Substrate
Meas. Tech.
ChEMBL_873326 (CHEMBL2185179)
Ki
500±n/a nM
Citation
 Orr, STRipp, SLBallard, TEHenderson, JLScott, DOObach, RSSun, HKalgutkar, AS Mechanism-based inactivation (MBI) of cytochrome P450 enzymes: structure-activity relationships and discovery strategies to mitigate drug-drug interaction risks. J Med Chem 55:4896-933 (2012)  
Target
Name:
Cytochrome P450 2B6
Synonyms:
CP2B6_HUMAN Cytochrome P450 2B6 (CYP2B6)
Type:
Protein
Mol. Mass.:
56289.75
Organism:
Homo sapiens (Human)
Description:
P20813
Residue:
491
  
Inhibitor
Name:
BDBM50397662
Synonyms:
CLOPIDOGREL
Type:
Small organic molecule
Emp. Form.:
C16H16ClNO2S
Mol. Mass.:
321.822
SMILES:
COC(=O)[C@@H](N1CCc2sccc2C1)c1ccccc1Cl
: