Target
Cytochrome P450 3A4
Ligand
BDBM50318884
Substrate
Meas. Tech.
ChEMBL_873336 (CHEMBL2185189)
Ki
12000±n/a nM
Citation
 Orr, STRipp, SLBallard, TEHenderson, JLScott, DOObach, RSSun, HKalgutkar, AS Mechanism-based inactivation (MBI) of cytochrome P450 enzymes: structure-activity relationships and discovery strategies to mitigate drug-drug interaction risks. J Med Chem 55:4896-933 (2012)  
Target
Name:
Cytochrome P450 3A4
Synonyms:
Albendazole monooxygenase CP3A4_HUMAN CYP3A4 CYPIIIA4 Cytochrome P450 3A4 (CYP3A4) Nifedipine oxidase Taurochenodeoxycholate 6-alpha-hydroxylase
Type:
Enzyme
Mol. Mass.:
57349.57
Organism:
Homo sapiens (Human)
Description:
Residue:
503
  
Inhibitor
Name:
BDBM50318884
Synonyms:
CHEMBL1084546 N-methyl-N-(3-((2-(2-oxoindolin-5-ylamino)-5-(trifluoromethyl)pyrimidin-4-ylamino)methyl)pyridin-2-yl)methanesulfonamide PF-562271
Type:
Small organic molecule
Emp. Form.:
C21H20F3N7O3S
Mol. Mass.:
507.489
SMILES:
CN(c1ncccc1CNc1nc(Nc2ccc3NC(=O)Cc3c2)ncc1C(F)(F)F)S(C)(=O)=O
: