Target
Adenosine receptor A3
Ligand
BDBM50067116
Substrate
Meas. Tech.
ChEMBL_874128 (CHEMBL2187069)
Ki
4200±n/a nM
Citation
 Baraldi, PGPreti, DBorea, PAVarani, K Medicinal chemistry of A3 adenosine receptor modulators: pharmacological activities and therapeutic implications. J Med Chem 55:5676-703 (2012)  
Target
Name:
Adenosine receptor A3
Synonyms:
AA3R_RAT Adenosine receptor A2a and A3 | Adora3
Type:
PROTEIN
Mol. Mass.:
36643.73
Organism:
Rattus norvegicus
Description:
ChEMBL_479910
Residue:
320
  
Inhibitor
Name:
BDBM50067116
Synonyms:
4-Methoxy-N-(3-pyridin-2-yl-isoquinolin-1-yl)-benzamide CHEMBL128929 | VUF-8504
Type:
Small organic molecule
Emp. Form.:
C22H17N3O2
Mol. Mass.:
355.3893
SMILES:
COc1ccc(cc1)C(=O)Nc1nc(cc2ccccc12)-c1ccccn1
: