Target
Adenosine receptor A3
Ligand
BDBM21217
Substrate
Meas. Tech.
ChEMBL_874127 (CHEMBL2187068)
Ki
26±n/a nM
Citation
 Baraldi, PGPreti, DBorea, PAVarani, K Medicinal chemistry of A3 adenosine receptor modulators: pharmacological activities and therapeutic implications. J Med Chem 55:5676-703 (2012)  
Target
Name:
Adenosine receptor A3
Synonyms:
A3 adenosine receptor (hA3) ADORA3 | Adenosine A3 receptor (A3AR)
Type:
G Protein-Coupled Receptor (GPCR)
Mol. Mass.:
36197.32
Organism:
Homo sapiens (Human)
Description:
P0DMS8
Residue:
318
  
Inhibitor
Name:
BDBM21217
Synonyms:
2-(4-methyl-1H-1,3-benzodiazol-2-yl)quinoxaline benzimidazole-quinoxaline, C3
Type:
Small organic molecule
Emp. Form.:
C16H12N4
Mol. Mass.:
260.2933
SMILES:
Cc1cccc2[nH]c(nc12)-c1cnc2ccccc2n1
: