Target
Adenosine receptor A3
Ligand
BDBM50397717
Substrate
Meas. Tech.
ChEMBL_874127 (CHEMBL2187068)
Ki
0.2±n/a nM
Citation
 Baraldi, PGPreti, DBorea, PAVarani, K Medicinal chemistry of A3 adenosine receptor modulators: pharmacological activities and therapeutic implications. J Med Chem 55:5676-703 (2012)  
Target
Name:
Adenosine receptor A3
Synonyms:
A3 adenosine receptor (hA3) ADORA3 | Adenosine A3 receptor (A3AR)
Type:
G Protein-Coupled Receptor (GPCR)
Mol. Mass.:
36197.32
Organism:
Homo sapiens (Human)
Description:
P0DMS8
Residue:
318
  
Inhibitor
Name:
BDBM50397717
Synonyms:
CHEMBL2181965
Type:
Small organic molecule
Emp. Form.:
C16H16BrN5O
Mol. Mass.:
374.235
SMILES:
CCCn1c2nc(nc2c2NCCn2c1=O)-c1ccc(Br)cc1
: