Target
Adenosine receptor A2a
Ligand
BDBM50053924
Substrate
Meas. Tech.
ChEMBL_874132 (CHEMBL2187073)
Ki
>10000±n/a nM
Citation
 Baraldi, PGPreti, DBorea, PAVarani, K Medicinal chemistry of A3 adenosine receptor modulators: pharmacological activities and therapeutic implications. J Med Chem 55:5676-703 (2012)  
Target
Name:
Adenosine receptor A2a
Synonyms:
AA2AR_RAT Adenosine A2 receptor Adenosine Receptors A2a (A2a) Adenosine receptors A2a Rat striatal adenosine A2a receptor
Type:
G Protein-Coupled Receptor (GPCR)
Mol. Mass.:
45015.65
Organism:
Rattus norvegicus (rat)
Description:
Rat A2A receptors expressed in CHO cells.
Residue:
410
  
Inhibitor
Name:
BDBM50053924
Synonyms:
3,6-Dichloro-2-(2-isopropoxy-4-methyl-phenyl)-chromen-4-one MRS1067
Type:
Small organic molecule
Emp. Form.:
C19H16Cl2O3
Mol. Mass.:
363.235
SMILES:
CC(C)Oc1cc(C)ccc1-c1oc2ccc(Cl)cc2c(=O)c1Cl
: