Target
Adenosine receptor A3
Ligand
BDBM50053924
Substrate
Meas. Tech.
ChEMBL_874128 (CHEMBL2187069)
Ki
5500±n/a nM
Citation
 Baraldi, PGPreti, DBorea, PAVarani, K Medicinal chemistry of A3 adenosine receptor modulators: pharmacological activities and therapeutic implications. J Med Chem 55:5676-703 (2012)  
Target
Name:
Adenosine receptor A3
Synonyms:
AA3R_RAT Adenosine receptor A2a and A3 | Adora3
Type:
PROTEIN
Mol. Mass.:
36643.73
Organism:
Rattus norvegicus
Description:
ChEMBL_479910
Residue:
320
  
Inhibitor
Name:
BDBM50053924
Synonyms:
3,6-Dichloro-2-(2-isopropoxy-4-methyl-phenyl)-chromen-4-one MRS1067
Type:
Small organic molecule
Emp. Form.:
C19H16Cl2O3
Mol. Mass.:
363.235
SMILES:
CC(C)Oc1cc(C)ccc1-c1oc2ccc(Cl)cc2c(=O)c1Cl
: